BDBM170157 10-((1-((3-(4-Chlorophenyl)-1,2,4-oxadiazol-5-yl)methyl)-1H-1,2,3-triazol-4-yl)methyl)-2-methylacridin-9(10H)-one (10h)
SMILES Cc1ccc2n(Cc3cn(Cc4nc(no4)-c4ccc(Cl)cc4)nn3)c3ccccc3c(=O)c2c1
InChI Key InChIKey=AYFFZSPOTCKJRY-UHFFFAOYSA-N
Data  2 IC50
  Tab Delimited (TSV)   2D SDfile   Computed 3D by Vconf -m prep SDfile
Find this compound or compounds like it in BindingDB:
Activity Spreadsheet -- Enzyme Inhibition Constant Data from BindingDB
Found 2 hits for monomerid = 170157
TargetCarboxylic ester hydrolase(Equus caballus (Horse))
Tehran University Of Medical Sciences
LigandPNGBDBM170157(10-((1-((3-(4-Chlorophenyl)-1,2,4-oxadiazol-5-yl)m...)
Affinity DataIC50: >1.00E+5nMpH: 8.0 T: 2°C. Assay description: To evaluate in vitro AChE activity, modified Ellman's method was performed using a 96-well plate reader (BioTek ELx808, Highland Park, IL, USA). ...
In DepthDetails ArticlePubMed
TargetAcetylcholinesterase(Electrophorus electricus (Electric eel))
Tehran University Of Medical Sciences
LigandPNGBDBM170157(10-((1-((3-(4-Chlorophenyl)-1,2,4-oxadiazol-5-yl)m...)
Affinity DataIC50: >1.00E+5nMpH: 8.0 T: 2°C. Assay description: To evaluate in vitro AChE activity, modified Ellman's method was performed using a 96-well plate reader (BioTek ELx808, Highland Park, IL, USA). ...
In DepthDetails ArticlePubMed