BDBM17040 (3Z)-2-oxo-3-[1-(1H-pyrrol-2-yl)ethylidene]-2,3-dihydro-1H-indole-5-sulfonamide::Indolinone based inhibitor, 4a
SMILES C\C(=C1\C(=O)Nc2ccc(cc12)S(N)(=O)=O)c1ccc[nH]1
InChI Key InChIKey=ZRFNJMWFTYWQPI-JYRVWZFOSA-N
Data  1 IC50
  Tab Delimited (TSV)   2D SDfile   Computed 3D by Vconf -m prep SDfile
Find this compound or compounds like it in BindingDB:
Activity Spreadsheet -- Enzyme Inhibition Constant Data from BindingDB
Found 1 hit for monomerid = 17040
Target3-phosphoinositide-dependent protein kinase 1(Homo sapiens (Human))
Berlex Biosciences
LigandPNGBDBM17040((3Z)-2-oxo-3-[1-(1H-pyrrol-2-yl)ethylidene]-2,3-di...)
Affinity DataIC50:  67nM. Assay description: The coupled assay can detect inhibitors of AKT2 activation, as well as direct inhibitors of PDK1 or AKT2. Inactive AKT2 is activated in situ by incub...
In DepthDetails ArticlePubMed