BDBM170433 US9085531, 4-(3,5-dimethyl-isoxazol-4-yl
SMILES CN1CC(c2c(C)noc2C)c2ccccc2C1
InChI Key InChIKey=IEHDEVXKWOALDJ-UHFFFAOYSA-N
Data  3 KI
  Tab Delimited (TSV)   2D SDfile   Computed 3D by Vconf -m prep SDfile
Find this compound or compounds like it in BindingDB:
Activity Spreadsheet -- Enzyme Inhibition Constant Data from BindingDB
Found 3 hits for monomerid = 170433
TargetSodium-dependent serotonin transporter(Homo sapiens (Human))
Albany Molecular Research
US Patent
LigandPNGBDBM170433(US9085531, 4-(3,5-dimethyl-isoxazol-4-yl)
Affinity DataKi:  1.40E+3nMpH: 7.4Assay Description:In order to evaluate the relative affinity of the various compounds at the NE, DA and 5HT transporters, HEK293E cell lines were developed to express ...
Ligand InfoPC cidPC sid
In DepthDetails US Patent
TargetSodium-dependent noradrenaline transporter(Homo sapiens (Human))
Albany Molecular Research
US Patent
LigandPNGBDBM170433(US9085531, 4-(3,5-dimethyl-isoxazol-4-yl)
Affinity DataKi:  4.14E+4nMpH: 7.4Assay Description:In order to evaluate the relative affinity of the various compounds at the NE, DA and 5HT transporters, HEK293E cell lines were developed to express ...
Ligand InfoPC cidPC sid
In DepthDetails US Patent
TargetSodium-dependent dopamine transporter(Homo sapiens (Human))
Albany Molecular Research
US Patent
LigandPNGBDBM170433(US9085531, 4-(3,5-dimethyl-isoxazol-4-yl)
Affinity DataKi:  1.28E+5nMpH: 7.4Assay Description:In order to evaluate the relative affinity of the various compounds at the NE, DA and 5HT transporters, HEK293E cell lines were developed to express ...
Ligand InfoPC cidPC sid
In DepthDetails US Patent