BDBM17049 Indolinone based inhibitor, 4k::[(3Z)-3-[(3-aminophenyl)(1H-pyrrol-2-yl)methylidene]-2-oxo-2,3-dihydro-1H-indol-5-yl]urea
SMILES NC(=O)Nc1ccc2NC(=O)\C(=C(/c3ccc[nH]3)c3cccc(N)c3)c2c1
InChI Key InChIKey=YKOQFISAFKIIKV-ZCXUNETKSA-N
Data  1 IC50
  Tab Delimited (TSV)   2D SDfile   Computed 3D by Vconf -m prep SDfile
Find this compound or compounds like it in BindingDB:
Activity Spreadsheet -- Enzyme Inhibition Constant Data from BindingDB
Found 1 hit for monomerid = 17049
Target3-phosphoinositide-dependent protein kinase 1(Homo sapiens (Human))
Berlex Biosciences
LigandPNGBDBM17049(Indolinone based inhibitor, 4k | [(3Z)-3-[(3-amino...)
Affinity DataIC50:  9nM. Assay description: The coupled assay can detect inhibitors of AKT2 activation, as well as direct inhibitors of PDK1 or AKT2. Inactive AKT2 is activated in situ by incub...
In DepthDetails ArticlePubMed