BDBM170776 US9085555, 204
SMILES CO[C@@H]1[C@@H](F)CN([C@@H]1C(=O)NCc1cccc(Cl)c1F)C(=O)Nc1cn(C(N)=O)c2ccccc12
InChI Key InChIKey=NAXCBXBOWJPZLE-RYGJVYDSSA-N
Data  1 IC50
  Tab Delimited (TSV)   2D SDfile   Computed 3D by Vconf -m prep SDfile
Find this compound or compounds like it in BindingDB:
Activity Spreadsheet -- Enzyme Inhibition Constant Data from BindingDB
Found 1 hit for monomerid = 170776
TargetComplement factor D(Homo sapiens (Human))
Novartis
US Patent
LigandPNGBDBM170776(US9085555, 204)
Affinity DataIC50:  7nMpH: 7.5 T: 2°C. Assay description: Recombinant human factor D (expressed in E. coli and purified using standard methods) at 10 nM concentration is incubated with test compound at vario...
In DepthDetails US Patent