BDBM17145 2-imino-thiazolidin-4-one analog, 7::N-[2-(dimethylamino)ethyl]-4-(5-{[(5Z)-2-imino-4-oxo-1,3-thiazolidin-5-ylidene]methyl}furan-2-yl)benzene-1-sulfonamide
SMILES CN(C)CCNS(=O)(=O)c1ccc(cc1)-c1ccc(\C=C2/SC(=N)NC2=O)o1
InChI Key InChIKey=BIUSOGXDWCLKOI-WJDWOHSUSA-N
Data  2 IC50
  Tab Delimited (TSV)   2D SDfile   Computed 3D by Vconf -m prep SDfile
Find this compound or compounds like it in BindingDB:
Activity Spreadsheet -- Enzyme Inhibition Constant Data from BindingDB
Found 2 hits for monomerid = 17145
TargetGlycogen synthase kinase-3 beta(Rattus norvegicus (rat))
Vernalis (R&D)
LigandPNGBDBM17145(2-imino-thiazolidin-4-one analog, 7 | N-[2-(dimeth...)
Affinity DataIC50:  510nMpH: 7.5 T: 2°C. Assay description: In vitro kinase assay using purified GSK-3 beta was incubated at room temperature with substrate, and test compounds in the presence of 10 uM ATP/ [g...
In DepthDetails ArticlePubMed
TargetCyclin-A2/Cyclin-dependent kinase 2(Homo sapiens (Human))
Vernalis (R&D)
LigandPNGBDBM17145(2-imino-thiazolidin-4-one analog, 7 | N-[2-(dimeth...)
Affinity DataIC50:  570nMpH: 7.5 T: 2°C. Assay description: In vitro kinase assay using purified CDK2/Cyclin A was incubated at room temperature with substrate, and test compounds in the presence of 100 uM ATP...
In DepthDetails ArticlePubMed