BDBM17179 (3S)-3-(4-{[3-(3-ethoxy-4-{[(2-methylphenyl)carbamoyl]amino}phenyl)-2-oxo-1,2-dihydropyridin-1-yl]methyl}phenyl)butanoic acid::Pyridone derivative, 25
SMILES CCOc1cc(ccc1NC(=O)Nc1ccccc1C)-c1cccn(Cc2ccc(cc2)[C@@H](C)CC(O)=O)c1=O
InChI Key InChIKey=IROXMOAIEFLDBH-QFIPXVFZSA-N
Data  1 KI
  Tab Delimited (TSV)   2D SDfile   Computed 3D by Vconf -m prep SDfile
Find this compound or compounds like it in BindingDB:
Activity Spreadsheet -- Enzyme Inhibition Constant Data from BindingDB
Found 1 hit for monomerid = 17179
TargetIntegrin alpha-4/beta-1 [T112H](Homo sapiens (Human))
Glaxosmithkline
LigandPNGBDBM17179((3S)-3-(4-{[3-(3-ethoxy-4-{[(2-methylphenyl)carbam...)
Affinity DataKi:  5.01nM. Assay description: J6 cells (1 million cells/well) were allowed to coat wheat germ agglutinin coated SPA beads (Amersham, 1 mg/well) in assay buffer. Tritiated 3H Stand...
In DepthDetails ArticlePubMed