BDBM171839 US9085584, 9
SMILES Cc1nc2ccc(nc2n2c(nnc12)-c1cc(O)ccc1Cl)C1CC1
InChI Key InChIKey=SCPBTWMZLCCZTO-UHFFFAOYSA-N
Data  2 IC50
  Tab Delimited (TSV)   2D SDfile   Computed 3D by Vconf -m prep SDfile
Find this compound or compounds like it in BindingDB:
Activity Spreadsheet -- Enzyme Inhibition Constant Data from BindingDB
Found 2 hits for monomerid = 171839
TargetcAMP and cAMP-inhibited cGMP 3',5'-cyclic phosphodiesterase 10A(Homo sapiens (Human))
Boehringer Ingelheim International
US Patent
LigandPNGBDBM171839(US9085584, 9)
Affinity DataIC50:  15nM. Assay description: The inhibition of PDE 2A or 10 enzyme activity was assessed using IMAP-Phosphodiesterase-cAMP fluorescence labeled substrate (Molecular Devices, Orde...
In DepthDetails US Patent
TargetcGMP-dependent 3',5'-cyclic phosphodiesterase(Homo sapiens (Human))
Boehringer Ingelheim International
US Patent
LigandPNGBDBM171839(US9085584, 9)
Affinity DataIC50:  1nM. Assay description: The inhibition of PDE 2A or 10 enzyme activity was assessed using IMAP-Phosphodiesterase-cAMP fluorescence labeled substrate (Molecular Devices, Orde...
In DepthDetails US Patent