BDBM172423 US9090618, ZA46::US9090618, ZA54::US9598411, Ref. No. ZA54
SMILES OC(=O)CN1CCC[C@H]1Cc1nc2ccccc2n1[C@@H]1C[C@@H]2CCC[C@H](C1)N2[C@H]1C[C@@H]2C[C@H](C1)CCCC2
InChI Key InChIKey=COWMKSSPBCWJGG-JBFJIUAJSA-N
Data  16 KI
  Tab Delimited (TSV)   2D SDfile   Computed 3D by Vconf -m prep SDfile
Find this compound or compounds like it in BindingDB:
Activity Spreadsheet -- Enzyme Inhibition Constant Data from BindingDB
Found 16 hits for monomerid = 172423
TargetOpioid growth factor receptor-like protein 1(Homo sapiens (Human))
Purdue Pharma
US Patent
LigandPNGBDBM172423(US9090618, ZA46 | US9090618, ZA54 | US9598411, Ref...)
Affinity DataKi:  17nM ΔG°:  -10.6kcal/molepH: 7.4 T: 2°C. Assay description: Radioligand binding assays (screening and dose-displacement) used 0.1 nM [3H]-nociceptin (NEN; 87.7 Ci/mmole) with 10-20 ug membrane protein in a fin...
In DepthDetails US Patent
TargetNociceptin receptor(Homo sapiens (Human))
Purdue Pharma
US Patent
LigandPNGBDBM172423(US9090618, ZA46 | US9090618, ZA54 | US9598411, Ref...)
Affinity DataKi:  17nM. Assay description: δ-Opioid Receptor Binding Assay Procedures: Radioligand dose-displacement assays used 0.2 nM [3H]-Naltrindole (NEN; 33.0 Ci/mmole) with 10-20 &#...
In DepthDetails US Patent
TargetOpioid growth factor receptor-like protein 1(Homo sapiens (Human))
Purdue Pharma
US Patent
LigandPNGBDBM172423(US9090618, ZA46 | US9090618, ZA54 | US9598411, Ref...)
Affinity DataKi:  49nM ΔG°:  -9.97kcal/molepH: 7.4 T: 2°C. Assay description: Radioligand binding assays (screening and dose-displacement) used 0.1 nM [3H]-nociceptin (NEN; 87.7 Ci/mmole) with 10-20 ug membrane protein in a fin...
In DepthDetails US Patent
TargetNociceptin receptor(Homo sapiens (Human))
Purdue Pharma
US Patent
LigandPNGBDBM172423(US9090618, ZA46 | US9090618, ZA54 | US9598411, Ref...)
Affinity DataKi:  49nM. Assay description: δ-Opioid Receptor Binding Assay Procedures: Radioligand dose-displacement assays used 0.2 nM [3H]-Naltrindole (NEN; 33.0 Ci/mmole) with 10-20 &#...
In DepthDetails US Patent
TargetKappa-type opioid receptor(Homo sapiens (Human))
Purdue Pharma
US Patent
LigandPNGBDBM172423(US9090618, ZA46 | US9090618, ZA54 | US9598411, Ref...)
Affinity DataKi:  254nM. Assay description: μ-Opioid Receptor Binding Assay Procedures: Radioligand binding assays were conducted using freshly thawed membranes expressing human μ-rec...
In DepthDetails US Patent
TargetKappa-type opioid receptor(Homo sapiens (Human))
Purdue Pharma
US Patent
LigandPNGBDBM172423(US9090618, ZA46 | US9090618, ZA54 | US9598411, Ref...)
Affinity DataKi:  254nMpH: 7.4Assay Description:Radioligand dose displacement assays used 0.4-0.8 nM [3H]-U69,593 (NEN; 40 Ci/mmole) with 10-20 μg membrane protein (recombinant kappa opioid re...
In DepthDetails US Patent
TargetKappa-type opioid receptor(Homo sapiens (Human))
Purdue Pharma
US Patent
LigandPNGBDBM172423(US9090618, ZA46 | US9090618, ZA54 | US9598411, Ref...)
Affinity DataKi:  344nM. Assay description: μ-Opioid Receptor Binding Assay Procedures: Radioligand binding assays were conducted using freshly thawed membranes expressing human μ-rec...
In DepthDetails US Patent
TargetKappa-type opioid receptor(Homo sapiens (Human))
Purdue Pharma
US Patent
LigandPNGBDBM172423(US9090618, ZA46 | US9090618, ZA54 | US9598411, Ref...)
Affinity DataKi:  344nMpH: 7.4Assay Description:Radioligand dose displacement assays used 0.4-0.8 nM [3H]-U69,593 (NEN; 40 Ci/mmole) with 10-20 μg membrane protein (recombinant kappa opioid re...
In DepthDetails US Patent
TargetMu-type opioid receptor(Homo sapiens (Human))
Purdue Pharma
US Patent
LigandPNGBDBM172423(US9090618, ZA46 | US9090618, ZA54 | US9598411, Ref...)
Affinity DataKi:  2.85E+3nM ΔG°:  -7.56kcal/molepH: 7.4 T: 2°C. Assay description: Radioligand binding assays were conducted using freshly thawed membranes expressing human mu-receptors (Perkin Elmer, Shelton, Conn.). Radioligand do...
In DepthDetails US Patent
TargetMu-type opioid receptor(Homo sapiens (Human))
Purdue Pharma
US Patent
LigandPNGBDBM172423(US9090618, ZA46 | US9090618, ZA54 | US9598411, Ref...)
Affinity DataKi:  2.85E+3nM. Assay description: κ-Opioid Receptor Binding Assay Procedures: Membranes from recombinant HEK-293 cells expressing the human kappa opioid receptor (kappa) (cloned ...
In DepthDetails US Patent
TargetMu-type opioid receptor(Homo sapiens (Human))
Purdue Pharma
US Patent
LigandPNGBDBM172423(US9090618, ZA46 | US9090618, ZA54 | US9598411, Ref...)
Affinity DataKi:  4.01E+3nM. Assay description: κ-Opioid Receptor Binding Assay Procedures: Membranes from recombinant HEK-293 cells expressing the human kappa opioid receptor (kappa) (cloned ...
In DepthDetails US Patent
TargetMu-type opioid receptor(Homo sapiens (Human))
Purdue Pharma
US Patent
LigandPNGBDBM172423(US9090618, ZA46 | US9090618, ZA54 | US9598411, Ref...)
Affinity DataKi:  4.01E+3nM ΔG°:  -7.36kcal/molepH: 7.4 T: 2°C. Assay description: Radioligand binding assays were conducted using freshly thawed membranes expressing human mu-receptors (Perkin Elmer, Shelton, Conn.). Radioligand do...
In DepthDetails US Patent
TargetDelta-type opioid receptor(Homo sapiens (Human))
Purdue Pharma
US Patent
LigandPNGBDBM172423(US9090618, ZA46 | US9090618, ZA54 | US9598411, Ref...)
Affinity DataKi:  2.00E+4nM. Assay description: ORL-1 Receptor Binding Assay Procedures: Membranes from recombinant HEK-293 cells expressing the human opioid receptor-like receptor (ORL-1) (Recepto...
In DepthDetails US Patent
TargetDelta-type opioid receptor(Homo sapiens (Human))
Purdue Pharma
US Patent
LigandPNGBDBM172423(US9090618, ZA46 | US9090618, ZA54 | US9598411, Ref...)
Affinity DataKi:  2.00E+4nM. Assay description: ORL-1 Receptor Binding Assay Procedures: Membranes from recombinant HEK-293 cells expressing the human opioid receptor-like receptor (ORL-1) (Recepto...
In DepthDetails US Patent
TargetDelta-type opioid receptor(Homo sapiens (Human))
Purdue Pharma
US Patent
LigandPNGBDBM172423(US9090618, ZA46 | US9090618, ZA54 | US9598411, Ref...)
Affinity DataKi: >2.00E+4nMpH: 7.4Assay Description:Radioligand dose-displacement assays used 0.2 nM [3H]-Naltrindole (NEN; 33.0 Ci/mmole) with 10-20 μg membrane protein (recombinant delta opioid ...
In DepthDetails US Patent
TargetDelta-type opioid receptor(Homo sapiens (Human))
Purdue Pharma
US Patent
LigandPNGBDBM172423(US9090618, ZA46 | US9090618, ZA54 | US9598411, Ref...)
Affinity DataKi: >2.00E+4nMpH: 7.4Assay Description:Radioligand dose-displacement assays used 0.2 nM [3H]-Naltrindole (NEN; 33.0 Ci/mmole) with 10-20 μg membrane protein (recombinant delta opioid ...
In DepthDetails US Patent