BDBM172440 US9090618, ZA63::US9598411, Ref. No. ZA63
SMILES COc1cnc(cn1)-c1nc2ccccc2n1[C@@H]1C[C@@H]2CCC[C@H](C1)N2[C@@H]1C[C@H]2CCC[C@H](C2)C1
InChI Key InChIKey=JPURFBYKZZKLOG-JYWISYRRSA-N
Data  2 KI
  Tab Delimited (TSV)   2D SDfile   Computed 3D by Vconf -m prep SDfile
Find this compound or compounds like it in BindingDB:
Activity Spreadsheet -- Enzyme Inhibition Constant Data from BindingDB
Found 2 hits for monomerid = 172440
TargetNociceptin receptor(Homo sapiens (Human))
Purdue Pharma
US Patent
LigandPNGBDBM172440(US9090618, ZA63 | US9598411, Ref. No. ZA63)
Affinity DataKi:  4.11nM. Assay description: δ-Opioid Receptor Binding Assay Procedures: Radioligand dose-displacement assays used 0.2 nM [3H]-Naltrindole (NEN; 33.0 Ci/mmole) with 10-20 &#...
In DepthDetails US Patent
TargetOpioid growth factor receptor-like protein 1(Homo sapiens (Human))
Purdue Pharma
US Patent
LigandPNGBDBM172440(US9090618, ZA63 | US9598411, Ref. No. ZA63)
Affinity DataKi:  4.11nM ΔG°:  -11.4kcal/molepH: 7.4 T: 2°C. Assay description: Radioligand binding assays (screening and dose-displacement) used 0.1 nM [3H]-nociceptin (NEN; 87.7 Ci/mmole) with 10-20 ug membrane protein in a fin...
In DepthDetails US Patent