BDBM172723 US9096515, 31a::US9296681, 31a
SMILES CCCC(=O)NCCNC(CC(C)C)C1(CCC1)c1ccc(Cl)c(Cl)c1
InChI Key InChIKey=ZJFMMMXNSXCMOB-UHFFFAOYSA-N
Data  6 KI
  Tab Delimited (TSV)   2D SDfile   Computed 3D by Vconf -m prep SDfile
Find this compound or compounds like it in BindingDB:
Activity Spreadsheet -- Enzyme Inhibition Constant Data from BindingDB
Found 6 hits for monomerid = 172723
TargetSodium-dependent noradrenaline transporter(Homo sapiens (Human))
Reviva Pharmaceuticals
US Patent
LigandPNGBDBM172723(US9096515, 31a | US9296681, 31a)
Affinity DataKi:  27.8nM. Assay description: The monoamine transporters inhibitory activities of selected compounds cycloalkylmethylamine derivatives comprising Formula (I) are reported herein. ...
Ligand InfoPC cidPC sid
In DepthDetails US Patent
TargetSodium-dependent serotonin transporter(Homo sapiens (Human))
Reviva Pharmaceuticals
US Patent
LigandPNGBDBM172723(US9096515, 31a | US9296681, 31a)
Affinity DataKi:  27.8nM. Assay description: The compounds were evaluated using well established radioligand binding assays protocols (Galli, A. et al., J. Exp. Biol. 1995, 198, 2197-2212; Giros...
Ligand InfoPC cidPC sid
In DepthDetails US Patent
TargetSodium-dependent dopamine transporter(Homo sapiens (Human))
Reviva Pharmaceuticals
US Patent
LigandPNGBDBM172723(US9096515, 31a | US9296681, 31a)
Affinity DataKi:  52.7nM. Assay description: The compounds were evaluated using well established radioligand binding assays protocols (Galli, A. et al., J. Exp. Biol. 1995, 198, 2197-2212; Giros...
Ligand InfoPC cidPC sid
In DepthDetails US Patent
TargetSodium-dependent dopamine transporter(Homo sapiens (Human))
Reviva Pharmaceuticals
US Patent
LigandPNGBDBM172723(US9096515, 31a | US9296681, 31a)
Affinity DataKi:  52.7nM. Assay description: The monoamine transporters inhibitory activities of selected compounds cycloalkylmethylamine derivatives comprising Formula (I) are reported herein. ...
Ligand InfoPC cidPC sid
In DepthDetails US Patent
TargetSodium-dependent noradrenaline transporter(Homo sapiens (Human))
Reviva Pharmaceuticals
US Patent
LigandPNGBDBM172723(US9096515, 31a | US9296681, 31a)
Affinity DataKi:  77.7nM. Assay description: The compounds were evaluated using well established radioligand binding assays protocols (Galli, A. et al., J. Exp. Biol. 1995, 198, 2197-2212; Giros...
Ligand InfoPC cidPC sid
In DepthDetails US Patent
TargetSodium-dependent noradrenaline transporter(Homo sapiens (Human))
Reviva Pharmaceuticals
US Patent
LigandPNGBDBM172723(US9096515, 31a | US9296681, 31a)
Affinity DataKi:  77.7nM. Assay description: The monoamine transporters inhibitory activities of selected compounds cycloalkylmethylamine derivatives comprising Formula (I) are reported herein. ...
Ligand InfoPC cidPC sid
In DepthDetails US Patent