BDBM172786 US9675593, 687
SMILES Cn1cc(cn1)-c1cn(-c2ccc(OC(F)(F)F)cc2)c(=O)c2nnn(CCF)c12
InChI Key InChIKey=FDTOQGNWMKIKGI-UHFFFAOYSA-N
Data  1 EC50
  Tab Delimited (TSV)   2D SDfile   Computed 3D by Vconf -m prep SDfile
Find this compound or compounds like it in BindingDB:
Activity Spreadsheet -- Enzyme Inhibition Constant Data from BindingDB
Found 1 hit for monomerid = 172786
TargetEndothelin-1(Homo sapiens (Human))
SRMLSC
US Patent
LigandPNGBDBM172786(US9675593, 687)
Affinity DataEC50: <5.00E+4nM. Assay description: Fibroblasts (primary human lung and dermal, HFL-1, 3T3 etc) are seeded in 96-well plates at ~15000 cells/well and serum starved for 0-48 hours. After...
Ligand InfoPC cidPC sid
In DepthDetails US Patent