BDBM173367 US10323032, Example 80::US9096596, 80::US9604982, Example 80
SMILES CC1Cc2c(CN1C(=O)c1ccc(F)c(Cl)c1Cl)nc(C)nc2-c1ccn[nH]1
InChI Key
Data  4 KI  8 IC50
  Tab Delimited (TSV)   2D SDfile   Computed 3D by Vconf -m prep SDfile
Find this compound or compounds like it in BindingDB:
Activity Spreadsheet -- Enzyme Inhibition Constant Data from BindingDB
Found 12 hits for monomerid = 173367
TargetP2X purinoceptor 7(Homo sapiens (Human))
Janssen Pharmaceutica
US Patent
LigandPNGBDBM173367(US10323032, Example 80 | US9096596, 80 | US9604982...)
Affinity DataKi:  25.1nM. Assay description: Human or rat P2X7-1321N1 cells were collected and frozen @ −80° C. On the day of the experiment, cell membrane preparations were made according...
In DepthDetails US Patent
TargetP2X purinoceptor 7(Homo sapiens (Human))
Janssen Pharmaceutica
US Patent
LigandPNGBDBM173367(US10323032, Example 80 | US9096596, 80 | US9604982...)
Affinity DataKi:  25.1nM. Assay description: Human or rat P2X7-1321 N1 cells were collected and frozen @−80° C. On the day of the experiment, cell membrane preparations were made according...
In DepthDetails US Patent
TargetP2X purinoceptor 7(Homo sapiens (Human))
Janssen Pharmaceutica
US Patent
LigandPNGBDBM173367(US10323032, Example 80 | US9096596, 80 | US9604982...)
Affinity DataKi:  25.1nM. Assay description: Human or rat P2X7-1321N1 cells were collected and frozen @ −80° C. On the day of the experiment, cell membrane preparations were made according...
In DepthDetails US Patent
TargetP2X purinoceptor 7(Homo sapiens (Human))
Janssen Pharmaceutica
US Patent
LigandPNGBDBM173367(US10323032, Example 80 | US9096596, 80 | US9604982...)
Affinity DataKi:  25.1nM. Assay description: human or rat P2X7-1321N1 cells were collected and frozen @ −80° C. On the day of the experiment, cell membrane preparations were made according...
In DepthDetails US Patent
TargetP2X purinoceptor 7(Homo sapiens (Human))
Janssen Pharmaceutica
US Patent
LigandPNGBDBM173367(US10323032, Example 80 | US9096596, 80 | US9604982...)
Affinity DataIC50:  25.1nM. Assay description: 1321N1 cells expressing the recombinant human or rat P2X7 channel was cultured in HyQ DME/(HyClone/Dulbecco's Modified Eagle Medium) high glucose...
In DepthDetails US Patent
TargetP2X purinoceptor 7(Rattus norvegicus (Rat))
Janssen Pharmaceutica
US Patent
LigandPNGBDBM173367(US10323032, Example 80 | US9096596, 80 | US9604982...)
Affinity DataIC50:  20nM. Assay description: Human or rat P2X7-1321N1 cells were collected and frozen @ −80° C. On the day of the experiment, cell membrane preparations were made according...
In DepthDetails US Patent
TargetP2X purinoceptor 7(Homo sapiens (Human))
Janssen Pharmaceutica
US Patent
LigandPNGBDBM173367(US10323032, Example 80 | US9096596, 80 | US9604982...)
Affinity DataIC50:  25.1nM. Assay description: 1321N1 cells expressing the recombinant human or rat P2X7 channel was cultured in HyQ DME/(HyClone/Dulbecco's Modified Eagle Medium) high glucose...
In DepthDetails US Patent
TargetP2X purinoceptor 7(Rattus norvegicus (Rat))
Janssen Pharmaceutica
US Patent
LigandPNGBDBM173367(US10323032, Example 80 | US9096596, 80 | US9604982...)
Affinity DataIC50:  20nM. Assay description: 1321N1 cells expressing the recombinant human or rat P2X7 channel was cultured in HyQ DME/(HyClone/Dulbecco's Modified Eagle Medium) high glucose...
In DepthDetails US Patent
TargetP2X purinoceptor 7(Homo sapiens (Human))
Janssen Pharmaceutica
US Patent
LigandPNGBDBM173367(US10323032, Example 80 | US9096596, 80 | US9604982...)
Affinity DataIC50:  25.1nM. Assay description: 1321N1 cells expressing the recombinant human or rat P2X7 channel was cultured in HyQ DME/(HyClone/Dulbecco's Modified Eagle Medium) high glucose...
In DepthDetails US Patent
TargetP2X purinoceptor 7(Rattus norvegicus (Rat))
Janssen Pharmaceutica
US Patent
LigandPNGBDBM173367(US10323032, Example 80 | US9096596, 80 | US9604982...)
Affinity DataIC50:  20nMpH: 7.4Assay Description:1321N1 cells expressing the recombinant human, rat or mouse P2X7 channel was cultured in HyQ DME/(HyClone/Dulbecco's Modified Eagle Medium) high gluc...
In DepthDetails US Patent
TargetP2X purinoceptor 7(Homo sapiens (Human))
Janssen Pharmaceutica
US Patent
LigandPNGBDBM173367(US10323032, Example 80 | US9096596, 80 | US9604982...)
Affinity DataIC50:  25.1nMpH: 7.4Assay Description:1321N1 cells expressing the recombinant human, rat or mouse P2X7 channel was cultured in HyQ DME/(HyClone/Dulbecco's Modified Eagle Medium) high gluc...
In DepthDetails US Patent
TargetP2X purinoceptor 7(Rattus norvegicus (Rat))
Janssen Pharmaceutica
US Patent
LigandPNGBDBM173367(US10323032, Example 80 | US9096596, 80 | US9604982...)
Affinity DataIC50:  20nM. Assay description: Human or rat P2X7-1321N1 cells were collected and frozen @ −80° C. On the day of the experiment, cell membrane preparations were made according...
In DepthDetails US Patent