BDBM173524 1-(4-Aminosulfonylphenyl)-3-(4-hydroxyphenyl)-5-(4-trifluoromethylphenyl)-1H-pyrazole (15g)
SMILES NS(=O)(=O)c1ccc(cc1)-n1nc(cc1-c1ccc(cc1)C(F)(F)F)-c1ccc(O)cc1
InChI Key InChIKey=KPSCHKYUTGCLDJ-UHFFFAOYSA-N
Data  2 IC50
  Tab Delimited (TSV)   2D SDfile   Computed 3D by Vconf -m prep SDfile
Find this compound or compounds like it in BindingDB:
Activity Spreadsheet -- Enzyme Inhibition Constant Data from BindingDB
Found 2 hits for monomerid = 173524
TargetProstaglandin G/H synthase 2 [E165G](Homo sapiens (Human))
Beni-Suef University
LigandPNGBDBM173524(1-(4-Aminosulfonylphenyl)-3-(4-hydroxyphenyl)-5-(4...)
Affinity DataIC50:  3.10E+3nM. Assay description: The ability of the test compounds to inhibit ovine COX01 and human recombinant COX-2 was determined using an enzyme immuno assay (EIA) kit according ...
In DepthDetails ArticlePubMed
TargetProstaglandin G/H synthase 1(Ovis aries (Sheep))
Beni-Suef University
LigandPNGBDBM173524(1-(4-Aminosulfonylphenyl)-3-(4-hydroxyphenyl)-5-(4...)
Affinity DataIC50:  9.60E+3nM. Assay description: The ability of the test compounds to inhibit ovine COX01 and human recombinant COX-2 was determined using an enzyme immuno assay (EIA) kit according ...
In DepthDetails ArticlePubMed