BDBM173563 1-(2-Oxo-2H-chromene-3-carbonyl)-3-(2-methoxyphenyl)thiourea (2b)
SMILES COc1ccccc1NC(=S)NC(=O)c1cc2ccccc2oc1=O
InChI Key InChIKey=LNGHOWOFDNAHRS-UHFFFAOYSA-N
Data  2 IC50
  Tab Delimited (TSV)   2D SDfile   Computed 3D by Vconf -m prep SDfile
Find this compound or compounds like it in BindingDB:
Activity Spreadsheet -- Enzyme Inhibition Constant Data from BindingDB
Found 2 hits for monomerid = 173563
TargetCarboxylic ester hydrolase(Equus caballus (Horse))
Quaid-I-Azam University
LigandPNGBDBM173563(1-(2-Oxo-2H-chromene-3-carbonyl)-3-(2-methoxypheny...)
Affinity DataIC50:  60nM. Assay description: Newly synthesized coumarin thioureas were tested against electric eel AChE and horse serum BChE. The cholinesterase inhibitory activity was measured ...
In DepthDetails ArticlePubMed
TargetAcetylcholinesterase(Electrophorus electricus (Electric eel))
Quaid-I-Azam University
LigandPNGBDBM173563(1-(2-Oxo-2H-chromene-3-carbonyl)-3-(2-methoxypheny...)
Affinity DataIC50:  1.33E+4nM. Assay description: Newly synthesized coumarin thioureas were tested against electric eel AChE and horse serum BChE. The cholinesterase inhibitory activity was measured ...
In DepthDetails ArticlePubMed