BDBM17370 1,2,4-Triazole Compound, 28::N-(4-methylphenyl)-5-[(pyridin-2-ylmethyl)sulfanyl]-4H-1,2,4-triazol-3-amine
SMILES Cc1ccc(Nc2nnc(SCc3ccccn3)[nH]2)cc1
InChI Key InChIKey=TZZXUFBSLJVBTR-UHFFFAOYSA-N
Data  1 KI
  Tab Delimited (TSV)   2D SDfile   Computed 3D by Vconf -m prep SDfile
Find this compound or compounds like it in BindingDB:
Activity Spreadsheet -- Enzyme Inhibition Constant Data from BindingDB
Found 1 hit for monomerid = 17370
TargetMethionine aminopeptidase 2(Homo sapiens (Human))
Gsk
LigandPNGBDBM17370(1,2,4-Triazole Compound, 28 | N-(4-methylphenyl)-5...)
Affinity DataKi:  7.80nM ΔG°:  -10.9kcal/molepH: 7.5 T: 2°C. Assay description: MetAP2 activity was monitored by measuring the initial velocity of turnover of the artificial substrate Met-AMC. Assays were performed in 96-well mi...
In DepthDetails ArticlePubMed