BDBM173866 US9102599, 47
SMILES O[C@H](CNCC(Cc1ccccc1)(c1cccc(OC(F)(F)F)c1)c1cccc(OC(F)(F)F)c1)C(F)(F)F
InChI Key InChIKey=DEYLVZYDQPRONF-JOCHJYFZSA-N
Data  1 IC50
  Tab Delimited (TSV)   2D SDfile   Computed 3D by Vconf -m prep SDfile
Find this compound or compounds like it in BindingDB:
Activity Spreadsheet -- Enzyme Inhibition Constant Data from BindingDB
Found 1 hit for monomerid = 173866
TargetCholesteryl ester transfer protein(Homo sapiens (Human))
Bristol-Myers Squibb
US Patent
LigandPNGBDBM173866(US9102599, 47)
Affinity DataIC50:  14nMpH: 7.4 T: 2°C. Assay description: Compounds of the present invention inhibit CETP-dependent cholesterol ester transfer from HDL to LDL as described here. Dilutions of compounds in DMS...
In DepthDetails US Patent