BDBM173902 US9688645, 1-8
SMILES C[C@H]1COCCCCOc2ccc(C[C@@H](NC(=O)N[C@@H](CCCCN)C(O)=O)C(=O)N1)cc2
InChI Key InChIKey=YWCJFURUASFZHP-FFZOFVMBSA-N
Data  1 IC50
  Tab Delimited (TSV)   2D SDfile   Computed 3D by Vconf -m prep SDfile
Find this compound or compounds like it in BindingDB:
Activity Spreadsheet -- Enzyme Inhibition Constant Data from BindingDB
Found 1 hit for monomerid = 173902
TargetCarboxypeptidase B2(Homo sapiens (Human))
Sanofi
US Patent
LigandPNGBDBM173902(US9688645, 1-8)
Affinity DataIC50:  29nMpH: 7.4 T: 2°C. Assay description: The prepared substances were tested for TAFIa inhibition using the Actichrome plasma TAFI Activity Kit from American Diagnostica (Pr. No. 874). This ...
Ligand InfoPC cidPC sid
In DepthDetails US Patent