BDBM173920 US9688645, 5-3
SMILES Nc1ccc(C[C@H](NC(=O)N[C@@H]2Cc3ccc(OCCCCOC[C@@H](NC2=O)C2CC2)cc3)C(O)=O)cn1
InChI Key InChIKey=PZGKNOUEAVBGDC-XPWALMASSA-N
Data  1 IC50
  Tab Delimited (TSV)   2D SDfile   Computed 3D by Vconf -m prep SDfile
Find this compound or compounds like it in BindingDB:
Activity Spreadsheet -- Enzyme Inhibition Constant Data from BindingDB
Found 1 hit for monomerid = 173920
TargetCarboxypeptidase B2(Homo sapiens (Human))
Sanofi
US Patent
LigandPNGBDBM173920(US9688645, 5-3)
Affinity DataIC50:  32nMpH: 7.4 T: 2°C. Assay description: The prepared substances were tested for TAFIa inhibition using the Actichrome plasma TAFI Activity Kit from American Diagnostica (Pr. No. 874). This ...
Ligand InfoPC cidPC sid
In DepthDetails US Patent