BDBM17394 1,2,4-Triazole Compound, 52::5-[(cyclohexylmethyl)sulfanyl]-N-(4-methoxyphenyl)-4H-1,2,4-triazol-3-amine
SMILES COc1ccc(Nc2nnc(SCC3CCCCC3)[nH]2)cc1
InChI Key InChIKey=QRZAVCKGFCAJMY-UHFFFAOYSA-N
Data  1 KI
  Tab Delimited (TSV)   2D SDfile   Computed 3D by Vconf -m prep SDfile
Find this compound or compounds like it in BindingDB:
Activity Spreadsheet -- Enzyme Inhibition Constant Data from BindingDB
Found 1 hit for monomerid = 17394
TargetMethionine aminopeptidase 2(Homo sapiens (Human))
Gsk
LigandPNGBDBM17394(1,2,4-Triazole Compound, 52 | 5-[(cyclohexylmethyl...)
Affinity DataKi:  3.10nM. Assay description: MetAP2 activity was monitored by measuring the initial velocity of turnover of the artificial substrate Met-AMC. Assays were performed in 96-well mi...
In DepthDetails ArticlePubMed