BDBM173982 US9102637, 17
SMILES CN1CCN(Cc2ccc(cc2)C(=O)Nc2sc(Nc3ccc4ccccc4c3)nc2C(N)=O)CC1
InChI Key InChIKey=DLCDLTNFAGTBSG-UHFFFAOYSA-N
Data  1 IC50
  Tab Delimited (TSV)   2D SDfile   Computed 3D by Vconf -m prep SDfile
Find this compound or compounds like it in BindingDB:
Activity Spreadsheet -- Enzyme Inhibition Constant Data from BindingDB
Found 1 hit for monomerid = 173982
TargetTRAF2 and NCK-interacting protein kinase(Homo sapiens (Human))
Carna Biosciences
US Patent
LigandPNGBDBM173982(US9102637, 17)
Affinity DataIC50:  5.10nMpH: 7.5 T: 2°C. Assay description: The kinase assays were conducted in a 20 μl volume using 384-well plates (Greiner). The reaction mixture consists of compound or vehicle (1% DMS...
In DepthDetails US Patent