BDBM174094 US9688668, 51
SMILES CCCCCCCCc1ccc(cc1)-c1noc(n1)[C@@H]1C[C@@H](O)CN1C(N)=N
InChI Key InChIKey=RPXDYOPZSHQFRH-MSOLQXFVSA-N
Data  2 KI
  Tab Delimited (TSV)   2D SDfile   Computed 3D by Vconf -m prep SDfile
Find this compound or compounds like it in BindingDB:
Activity Spreadsheet -- Enzyme Inhibition Constant Data from BindingDB
Found 2 hits for monomerid = 174094
TargetSphingosine kinase 1(Homo sapiens (Human))
University Of Virginia Patent Foundation
US Patent
LigandPNGBDBM174094(US9688668, 51)
Affinity DataKi: >1.00E+4nM. Assay description: SphK activity was measured by a scintillation proximity assay as previously described [1], the disclosure of which is incorporated herein. Briefly, r...
Ligand InfoPC cidPC sid
In DepthDetails US Patent
TargetSphingosine kinase 2(Homo sapiens (Human))
University Of Virginia Patent Foundation
US Patent
LigandPNGBDBM174094(US9688668, 51)
Affinity DataKi:  5.50E+4nM. Assay description: SphK activity was measured by a scintillation proximity assay as previously described [1], the disclosure of which is incorporated herein. Briefly, r...
Ligand InfoPC cidPC sid
In DepthDetails US Patent