BDBM174138 US9102637, 173
SMILES NC(=O)c1nc(Nc2ccc3ccccc3c2)sc1NC(=O)c1ccc(CN2CCC(O)CC2)cc1
InChI Key InChIKey=IIOIOUYIVMDCKX-UHFFFAOYSA-N
Data  1 IC50
  Tab Delimited (TSV)   2D SDfile   Computed 3D by Vconf -m prep SDfile
Find this compound or compounds like it in BindingDB:
Activity Spreadsheet -- Enzyme Inhibition Constant Data from BindingDB
Found 1 hit for monomerid = 174138
TargetTRAF2 and NCK-interacting protein kinase(Homo sapiens (Human))
Carna Biosciences
US Patent
LigandPNGBDBM174138(US9102637, 173)
Affinity DataIC50:  3.40nMpH: 7.5 T: 2°C. Assay description: The kinase assays were conducted in a 20 μl volume using 384-well plates (Greiner). The reaction mixture consists of compound or vehicle (1% DMS...
In DepthDetails US Patent