BDBM174194 US9688669, Example 50
SMILES CC(C)C#Cc1cncc(c1)[C@H]1NC(=O)O[C@@H]1c1cccc(F)c1
InChI Key InChIKey=BVOIQTCJKVBSAS-QZTJIDSGSA-N
Data  1 EC50
  Tab Delimited (TSV)   2D SDfile   Computed 3D by Vconf -m prep SDfile
Find this compound or compounds like it in BindingDB:
Activity Spreadsheet -- Enzyme Inhibition Constant Data from BindingDB
Found 1 hit for monomerid = 174194
TargetIsoform 1 of Metabotropic glutamate receptor 5 (5a)(Homo sapiens (Human))
Bristol-Myers Squibb
US Patent
LigandPNGBDBM174194(US9688669, Example 50)
Affinity DataEC50: >3.23E+3nM. Assay description: HEK293 (ZF) cells stably transfected with human mGluR5A (pIRES neo) and the rat glutamate-aspartate transporter (GLAST; pIRES puro) are grown in a mo...
Ligand InfoPC cidPC sid
In DepthDetails US Patent