BDBM174251 US9688669, Example 82
SMILES Fc1ccc(F)c(c1)[C@H]1OC(=O)N[C@@H]1c1cncc(c1)C#CC12CCC(CC1)CC2
InChI Key InChIKey=KNXGKUUCRKTNOU-VYHLSTNFSA-N
Data  1 EC50
  Tab Delimited (TSV)   2D SDfile   Computed 3D by Vconf -m prep SDfile
Find this compound or compounds like it in BindingDB:
Activity Spreadsheet -- Enzyme Inhibition Constant Data from BindingDB
Found 1 hit for monomerid = 174251
TargetIsoform 1 of Metabotropic glutamate receptor 5 (5a)(Homo sapiens (Human))
Bristol-Myers Squibb
US Patent
LigandPNGBDBM174251(US9688669, Example 82)
Affinity DataEC50:  1.31E+3nM. Assay description: HEK293 (ZF) cells stably transfected with human mGluR5A (pIRES neo) and the rat glutamate-aspartate transporter (GLAST; pIRES puro) are grown in a mo...
Ligand InfoPC cidPC sid
In DepthDetails US Patent