BDBM174260 US9688669, Example 91
SMILES Fc1cccc(c1)[C@H]1OC(=O)N[C@@H]1c1cncc(c1)C#CC1(F)CCCCC1
InChI Key InChIKey=LYZABUZCEWTITC-WOJBJXKFSA-N
Data  1 EC50
  Tab Delimited (TSV)   2D SDfile   Computed 3D by Vconf -m prep SDfile
Find this compound or compounds like it in BindingDB:
Activity Spreadsheet -- Enzyme Inhibition Constant Data from BindingDB
Found 1 hit for monomerid = 174260
TargetIsoform 1 of Metabotropic glutamate receptor 5 (5a)(Homo sapiens (Human))
Bristol-Myers Squibb
US Patent
LigandPNGBDBM174260(US9688669, Example 91)
Affinity DataEC50:  96nM. Assay description: HEK293 (ZF) cells stably transfected with human mGluR5A (pIRES neo) and the rat glutamate-aspartate transporter (GLAST; pIRES puro) are grown in a mo...
Ligand InfoPC cidPC sid
In DepthDetails US Patent