BDBM174406 US9688676, 8 (R)-2-(3-(4-amino-2-oxo-3-(4-phenoxyphenyl)-2,3-dihydro-1H-imidazo[4,5-c]pyridin-1-yl)piperidine-1-carbonyl)-3-cyclobutylacrylonitrile
SMILES Nc1nccc2n([C@@H]3CCCN(C3)C(=O)C(=CC3CCC3)C#N)c(=O)n(-c3ccc(Oc4ccccc4)cc3)c12
InChI Key InChIKey=XHMAQFDZMYBULD-XMMPIXPASA-N
Data  1 IC50
  Tab Delimited (TSV)   2D SDfile   Computed 3D by Vconf -m prep SDfile
Find this compound or compounds like it in BindingDB:
Activity Spreadsheet -- Enzyme Inhibition Constant Data from BindingDB
Found 1 hit for monomerid = 174406
TargetTyrosine-protein kinase BTK(Homo sapiens (Human))
Principia Biopharma
US Patent
LigandPNGBDBM174406(US9688676, 8 (R)-2-(3-(4-amino-2-oxo-3-(4-phenoxyp...)
Affinity DataIC50:  24nMT: 2°C. Assay description: A Caliper-based kinase assay (Caliper Life Sciences, Hopkinton, Mass.) was used to measure inhibition of BTK kinase activity of a compound of the pre...
Ligand InfoPC cidPC sid
In DepthDetails US Patent