BDBM174558 US9688676, 23 (S)-4-amino-1-((1-(but-2-ynoyl)pyrrolidin-2-yl)methyl)-3-(4-phenoxyphenyl)-1H-imidazo[4,5-c]pyridin-2(3H)-one
SMILES CC#CC(=O)N1CCCC1Cn1c2ccnc(N)c2n(-c2ccc(Oc3cccc(F)c3F)cc2)c1=O
InChI Key InChIKey=SGLNVJWYXNMHOH-UHFFFAOYSA-N
Data  1 IC50
  Tab Delimited (TSV)   2D SDfile   Computed 3D by Vconf -m prep SDfile
Find this compound or compounds like it in BindingDB:
Activity Spreadsheet -- Enzyme Inhibition Constant Data from BindingDB
Found 1 hit for monomerid = 174558
TargetTyrosine-protein kinase BTK(Homo sapiens (Human))
Principia Biopharma
US Patent
LigandPNGBDBM174558(US9688676, 23 (S)-4-amino-1-((1-(but-2-ynoyl)pyrro...)
Affinity DataIC50:  26nMT: 2°C. Assay description: A Caliper-based kinase assay (Caliper Life Sciences, Hopkinton, Mass.) was used to measure inhibition of BTK kinase activity of a compound of the pre...
Ligand InfoPC cidPC sid
In DepthDetails US Patent