BDBM174594 US9688676, 30 (R)-2-(3-(4-amino-2-oxo-3-(4-phenoxyphenyl)-2,3-dihydro-1H-imidazo[4,5-c]pyridin-1-yl)piperidine-1-carbonyl)-4-methyl-4-(4-(3-methyloxetan-3-yl)piperazin-1-yl)pent-2-enenitrile
SMILES CC(C)(C=C(C#N)C(=O)N1CCC[C@H](C1)n1c2ccnc(N)c2n(-c2ccc(Oc3ccccc3)cc2)c1=O)N1CCN(CC1)C1(C)COC1
InChI Key InChIKey=VINZPWXIFDZJRW-GDLZYMKVSA-N
Data  1 IC50
  Tab Delimited (TSV)   2D SDfile   Computed 3D by Vconf -m prep SDfile
Find this compound or compounds like it in BindingDB:
Activity Spreadsheet -- Enzyme Inhibition Constant Data from BindingDB
Found 1 hit for monomerid = 174594
TargetTyrosine-protein kinase BTK(Homo sapiens (Human))
Principia Biopharma
US Patent
LigandPNGBDBM174594(US9688676, 30 (R)-2-(3-(4-amino-2-oxo-3-(4-phenoxy...)
Affinity DataIC50:  1.5nMT: 2°C. Assay description: A Caliper-based kinase assay (Caliper Life Sciences, Hopkinton, Mass.) was used to measure inhibition of BTK kinase activity of a compound of the pre...
Ligand InfoPC cidPC sid
In DepthDetails US Patent