BDBM174608 US9688676, 38 (R)-2-(3-(4-amino-3-(4-(2-fluorophenoxy)phenyl)-2-oxo-2,3-dihydro-1H-imidazo[4,5-c]pyridin-1-yl)piperidine-1-carbonyl)-4-methyl-4-(4-(oxetan-3-yl)piperazin-1-yl)pent-2-enenitrile
SMILES CC(C)(C=C(C#N)C(=O)N1CCC[C@H](C1)n1c2ccnc(N)c2n(-c2ccc(Oc3ccccc3F)cc2)c1=O)N1CCN(CC1)C1COC1
InChI Key InChIKey=CDYOSOBNSZUNOB-HHHXNRCGSA-N
Data  1 IC50
  Tab Delimited (TSV)   2D SDfile   Computed 3D by Vconf -m prep SDfile
Find this compound or compounds like it in BindingDB:
Activity Spreadsheet -- Enzyme Inhibition Constant Data from BindingDB
Found 1 hit for monomerid = 174608
TargetTyrosine-protein kinase BTK(Homo sapiens (Human))
Principia Biopharma
US Patent
LigandPNGBDBM174608(US9688676, 38 (R)-2-(3-(4-amino-3-(4-(2-fluorophen...)
Affinity DataIC50:  5.70nMT: 2°C. Assay description: A Caliper-based kinase assay (Caliper Life Sciences, Hopkinton, Mass.) was used to measure inhibition of BTK kinase activity of a compound of the pre...
Ligand InfoPC cidPC sid
In DepthDetails US Patent