BDBM174829 US10053462, 60::US9102686, 60::US9540388, 60
SMILES FC(F)(F)c1nccc(C(=O)N2[C@H]3CC[C@@H]2c2nnc(-c4ccc(Cl)s4)n2C3)c1Cl
InChI Key InChIKey=GJHOWLLTPBIIIA-WCBMZHEXSA-N
Data  5 KI  7 IC50
  Tab Delimited (TSV)   2D SDfile   Computed 3D by Vconf -m prep SDfile
Find this compound or compounds like it in BindingDB:
Activity Spreadsheet -- Enzyme Inhibition Constant Data from BindingDB
Found 9 hits for monomerid = 174829
TargetP2X purinoceptor 7(Homo sapiens (Human))
Janssen Pharmaceutica
US Patent
LigandPNGBDBM174829(US10053462, 60 | US9102686, 60 | US9540388, 60)
Affinity DataKi:  21.9nM. Assay description: Human or rat P2X7-1321N1 cells were collected and frozen @-80.degree. C. On the day of the experiment, cell membrane preparations were made according...
In DepthDetails US Patent
TargetP2X purinoceptor 7(Homo sapiens (Human))
Janssen Pharmaceutica
US Patent
LigandPNGBDBM174829(US10053462, 60 | US9102686, 60 | US9540388, 60)
Affinity DataKi:  21.9nM. Assay description: human or rat P2X7-1321N1 cells were collected and frozen @ −80° C. On the day of the experiment, cell membrane preparations were made according...
In DepthDetails US Patent
TargetP2X purinoceptor 7(Homo sapiens (Human))
Janssen Pharmaceutica
US Patent
LigandPNGBDBM174829(US10053462, 60 | US9102686, 60 | US9540388, 60)
Affinity DataKi:  22nM IC50:  15nMpH: 7.4Assay Description:1321N1 cells expressing the recombinant human or rat P2X7 channel was cultured in HyQ DME/(HyClone/Dulbecco's Modified Eagle Medium) high glucose...
In DepthDetails US Patent
TargetP2X purinoceptor 7(Homo sapiens (Human))
Janssen Pharmaceutica
US Patent
LigandPNGBDBM174829(US10053462, 60 | US9102686, 60 | US9540388, 60)
Affinity DataKi:  22nM IC50: >1.00E+4nM. Assay description: human or rat P2X7-1321N1 cells were collected and frozen @−80° C. On the day of the experiment, cell membrane preparations were made according ...
In DepthDetails US Patent
TargetP2X purinoceptor 7(Rattus norvegicus (Rat))
Janssen Pharmaceutica
US Patent
LigandPNGBDBM174829(US10053462, 60 | US9102686, 60 | US9540388, 60)
Affinity DataKi:  22nM IC50:  2.34E+3nMpH: 7.4Assay Description:1321N1 cells expressing the recombinant human or rat P2X7 channel was cultured in HyQ DME/(HyClone/Dulbecco's Modified Eagle Medium) high glucose...
In DepthDetails US Patent
TargetP2X purinoceptor 7(Mus musculus)
Janssen Pharmaceutica
US Patent
LigandPNGBDBM174829(US10053462, 60 | US9102686, 60 | US9540388, 60)
Affinity DataIC50:  2.34E+3nMpH: 7.4Assay Description:1321N1 cells expressing the recombinant human or rat P2X7 channel was cultured in HyQ DME/(HyClone/Dulbecco's Modified Eagle Medium) high glucose...
In DepthDetails US Patent
TargetP2X purinoceptor 7(Rattus norvegicus (Rat))
Janssen Pharmaceutica
US Patent
LigandPNGBDBM174829(US10053462, 60 | US9102686, 60 | US9540388, 60)
Affinity DataIC50:  2.34E+3nMpH: 7.4Assay Description:Ca.sup.2+flux: 1321N1 cells expressing the recombinant human, rat or mouse P2X7 channel was cultured in HyQ DME/(HyClone/Dulbecco's Modified Eagle Me...
In DepthDetails US Patent
TargetP2X purinoceptor 7(Homo sapiens (Human))
Janssen Pharmaceutica
US Patent
LigandPNGBDBM174829(US10053462, 60 | US9102686, 60 | US9540388, 60)
Affinity DataIC50:  14.9nMpH: 7.4Assay Description:Ca.sup.2+flux: 1321N1 cells expressing the recombinant human, rat or mouse P2X7 channel was cultured in HyQ DME/(HyClone/Dulbecco's Modified Eagle Me...
In DepthDetails US Patent
TargetP2X purinoceptor 7(Homo sapiens (Human))
Janssen Pharmaceutica
US Patent
LigandPNGBDBM174829(US10053462, 60 | US9102686, 60 | US9540388, 60)
Affinity DataIC50:  14.9nMpH: 7.4Assay Description:1321N1 cells expressing the recombinant human or rat P2X7 channel was cultured in HyQ DME/(HyClone/Dulbecco's Modified Eagle Medium) high glucose...
In DepthDetails US Patent