BDBM174965 US9096593, P-2003
SMILES Clc1cnc2[nH]cc(Cc3ccc(NCc4ccc(Cl)nc4)nc3)c2c1
InChI Key InChIKey=IHUPHYFSKVFFFO-UHFFFAOYSA-N
Data  9 IC50
  Tab Delimited (TSV)   2D SDfile   Computed 3D by Vconf -m prep SDfile
Find this compound or compounds like it in BindingDB:
Activity Spreadsheet -- Enzyme Inhibition Constant Data from BindingDB
Found 9 hits for monomerid = 174965
TargetMacrophage colony-stimulating factor 1 receptor(Homo sapiens (Human))
Plexxikon
US Patent
LigandPNGBDBM174965(US9096593, P-2003)
Affinity DataIC50: <100nMpH: 7.5 T: 2°C. Assay description: In one assay the biochemical activity IC50 values are determined with respect to inhibition of Fms kinase activity, where inhibition of phosphorylati...
In DepthDetails US Patent
TargetMast/stem cell growth factor receptor Kit(Homo sapiens (Human))
Plexxikon
US Patent
LigandPNGBDBM174965(US9096593, P-2003)
Affinity DataIC50: <100nMpH: 7.5Assay Description:In one assay the biochemical activity IC50 values are determined with respect to inhibition of c-Kit kinase activity, where inhibition of phosphoryla...
In DepthDetails US Patent
TargetReceptor-type tyrosine-protein kinase FLT3(Homo sapiens (Human))
Plexxikon
US Patent
LigandPNGBDBM174965(US9096593, P-2003)
Affinity DataIC50: <100nMpH: 7.5 T: 2°C. Assay description: In one assay the biochemical activity IC50 values are determined with respect to inhibition of Flt-3 kinase activity, where inhibition of phosphoryla...
In DepthDetails US Patent
TargetCytochrome P450 1A2(Homo sapiens (Human))
Plexxikon
US Patent
LigandPNGBDBM174965(US9096593, P-2003)
Affinity DataIC50: >1.00E+4nM. Assay description: CYP (Cytochrome P450) enzymes are the major drug metabolizing enzymes present in the liver. The inhibition of CYP enzyme activity (IC50) for each of ...
In DepthDetails US Patent
TargetCytochrome P450 3A4(Homo sapiens (Human))
Plexxikon
US Patent
LigandPNGBDBM174965(US9096593, P-2003)
Affinity DataIC50: >1.00E+4nM. Assay description: CYP (Cytochrome P450) enzymes are the major drug metabolizing enzymes present in the liver. The inhibition of CYP enzyme activity (IC50) for each of ...
In DepthDetails US Patent
TargetCytochrome P450 2C9(Homo sapiens (Human))
Plexxikon
US Patent
LigandPNGBDBM174965(US9096593, P-2003)
Affinity DataIC50: <5.00E+3nM. Assay description: CYP (Cytochrome P450) enzymes are the major drug metabolizing enzymes present in the liver. The inhibition of CYP enzyme activity (IC50) for each of ...
In DepthDetails US Patent
TargetCytochrome P450 2D6(Homo sapiens (Human))
Plexxikon
US Patent
LigandPNGBDBM174965(US9096593, P-2003)
Affinity DataIC50: >1.00E+4nM. Assay description: CYP (Cytochrome P450) enzymes are the major drug metabolizing enzymes present in the liver. The inhibition of CYP enzyme activity (IC50) for each of ...
In DepthDetails US Patent
TargetCytochrome P450 3A4(Homo sapiens (Human))
Plexxikon
US Patent
LigandPNGBDBM174965(US9096593, P-2003)
Affinity DataIC50:  5.00E+3nM. Assay description: CYP (Cytochrome P450) enzymes are the major drug metabolizing enzymes present in the liver. The inhibition of CYP enzyme activity (IC50) for each of ...
In DepthDetails US Patent
TargetCytochrome P450 2C19(Homo sapiens (Human))
Plexxikon
US Patent
LigandPNGBDBM174965(US9096593, P-2003)
Affinity DataIC50:  5.00E+3nM. Assay description: CYP (Cytochrome P450) enzymes are the major drug metabolizing enzymes present in the liver. The inhibition of CYP enzyme activity (IC50) for each of ...
In DepthDetails US Patent