BDBM174969 US9688678, 2 (+-)-1-(2,4-dimethoxyphenyl)sulfonyl-3-(2-ethoxy-5-methoxy-phenyl)-3-[2-(1-methyl-4-piperidyl)-2,6-diazaspiro[3.3]heptan-6-yl]-2-oxo-indoline-5-carbonitrile
SMILES CCOc1ccc(OC)c(c1)C1(C2C=C(C=CC2N(C1=O)S(=O)(=O)c1ccc(OC)cc1OC)C#N)N1CC2(CN(C2)C2CCN(C)CC2)C1
InChI Key InChIKey=ZXXDTIHFUAMFKB-UHFFFAOYSA-N
Data  1 KI
  Tab Delimited (TSV)   2D SDfile   Computed 3D by Vconf -m prep SDfile
Find this compound or compounds like it in BindingDB:
Activity Spreadsheet -- Enzyme Inhibition Constant Data from BindingDB
Found 1 hit for monomerid = 174969
TargetVasopressin V1b receptor(Homo sapiens (Human))
Abbvie Deutschland
US Patent
LigandPNGBDBM174969(US9688678, 2 (+-)-1-(2,4-dimethoxyphenyl)sulfonyl-...)
Affinity DataKi:  55nM ΔG°:  -9.90kcal/molepH: 7.4 T: 2°C. Assay description: The binding assay was carried out by the method based on that of Tahara et al. (Tahara A et al., Brit. J. Pharmacol. 125, 1463-1470 (1998)). The incu...
Ligand InfoPC cidPC sid
In DepthDetails US Patent