BDBM175093 US9115102, Ex27
SMILES ONC(=O)C(CNC(=O)c1ccc(OCc2c(nn3ccccc23)C(F)(F)F)cc1)N1CCN(Cc2ccccc2)CC1
InChI Key InChIKey=PWHWIWBGOFSUOR-UHFFFAOYSA-N
Data  7 IC50
  Tab Delimited (TSV)   2D SDfile   Computed 3D by Vconf -m prep SDfile
Find this compound or compounds like it in BindingDB:
Activity Spreadsheet -- Enzyme Inhibition Constant Data from BindingDB
Found 7 hits for monomerid = 175093
TargetDisintegrin and metalloproteinase domain-containing protein 17(Homo sapiens (Human))
Galderma Research & Development
US Patent
LigandPNGBDBM175093(US9115102, Ex27)
Affinity DataIC50:  81nMpH: 7.4Assay Description:The TACE enzyme is an internal production (carried out according to the publication protein Eng Des Sel, 2006, 19, 155-161) and is added so as to hav...
Ligand InfoPC cidPC sid
In DepthDetails US Patent
TargetInterstitial collagenase(Homo sapiens (Human))
Galderma Research & Development
US Patent
LigandPNGBDBM175093(US9115102, Ex27)
Affinity DataIC50: >1.00E+4nM. Assay description: The molecules are tested in dose-response studies on the following enzymes MMP1, MMP3, MMP9, ADAMS and ADAM10 according to the same protocol as that ...
Ligand InfoPC cidPC sid
In DepthDetails US Patent
TargetStromelysin-1(Homo sapiens (Human))
Galderma Research & Development
US Patent
LigandPNGBDBM175093(US9115102, Ex27)
Affinity DataIC50: >1.00E+4nM. Assay description: The molecules are tested in dose-response studies on the following enzymes MMP1, MMP3, MMP9, ADAMS and ADAM10 according to the same protocol as that ...
Ligand InfoPC cidPC sid
In DepthDetails US Patent
TargetDisintegrin and metalloproteinase domain-containing protein 17(Homo sapiens (Human))
Galderma Research & Development
US Patent
LigandPNGBDBM175093(US9115102, Ex27)
Affinity DataIC50:  81nM. Assay description: The molecules are tested in dose-response studies on the following enzymes MMP1, MMP3, MMP9, ADAMS and ADAM10 according to the same protocol as that ...
Ligand InfoPC cidPC sid
In DepthDetails US Patent
TargetDisintegrin and metalloproteinase domain-containing protein 9(Homo sapiens (Human))
Galderma Research & Development
US Patent
LigandPNGBDBM175093(US9115102, Ex27)
Affinity DataIC50: >1.00E+4nM. Assay description: The molecules are tested in dose-response studies on the following enzymes MMP1, MMP3, MMP9, ADAMS and ADAM10 according to the same protocol as that ...
Ligand InfoPC cidPC sid
In DepthDetails US Patent
TargetDisintegrin and metalloproteinase domain-containing protein 10(Homo sapiens (Human))
Galderma Research & Development
US Patent
LigandPNGBDBM175093(US9115102, Ex27)
Affinity DataIC50: >1.00E+4nM. Assay description: The molecules are tested in dose-response studies on the following enzymes MMP1, MMP3, MMP9, ADAMS and ADAM10 according to the same protocol as that ...
Ligand InfoPC cidPC sid
In DepthDetails US Patent
TargetMatrix metalloproteinase-9(Homo sapiens (Human))
Galderma Research & Development
US Patent
LigandPNGBDBM175093(US9115102, Ex27)
Affinity DataIC50: >1.00E+4nM. Assay description: The molecules are tested in dose-response studies on the following enzymes MMP1, MMP3, MMP9, ADAMS and ADAM10 according to the same protocol as that ...
Ligand InfoPC cidPC sid
In DepthDetails US Patent