BDBM175219 US10112931, Example 213::US9688672, Example 213
SMILES C[C@@H](O)[C@H]1COC(=O)N1c1cc(Cl)nc(N[C@@H](C)c2cc(on2)-c2ccc(Cl)cc2)n1
InChI Key InChIKey=IPBYIAIAZKELOY-FIXISWKDSA-N
Data  6 IC50
  Tab Delimited (TSV)   2D SDfile   Computed 3D by Vconf -m prep SDfile
Find this compound or compounds like it in BindingDB:
Activity Spreadsheet -- Enzyme Inhibition Constant Data from BindingDB
Found 6 hits for monomerid = 175219
TargetIsocitrate dehydrogenase [NADP] cytoplasmic [R132H](Homo sapiens (Human))
Novartis
US Patent
LigandPNGBDBM175219(US10112931, Example 213 | US9688672, Example 213)
Affinity DataIC50:  11nMpH: 7.5 T: 2°C. Assay description: The IDH1 (R132H) mutant catalyzes the reduced form of NADP+(NADPH) and α-ketoglutarate (α-KG) to form nicotinamide adenine dinucleotide pho...
Ligand InfoPC cidPC sid
In DepthDetails US Patent
TargetIsocitrate dehydrogenase [NADP] cytoplasmic [R132H](Homo sapiens (Human))
Novartis
US Patent
LigandPNGBDBM175219(US10112931, Example 213 | US9688672, Example 213)
Affinity DataIC50:  19nMpH: 7.5 T: 2°C. Assay description: The IDH1 (R132H) mutant catalyzes the reduced form of NADP+(NADPH) and α-ketoglutarate (α-KG) to form nicotinamide adenine dinucleotide pho...
Ligand InfoPC cidPC sid
In DepthDetails US Patent
TargetIsocitrate dehydrogenase [NADP] cytoplasmic [R132H](Homo sapiens (Human))
Novartis
US Patent
LigandPNGBDBM175219(US10112931, Example 213 | US9688672, Example 213)
Affinity DataIC50:  18nMpH: 7.4 T: 2°C. Assay description: Mutant IDH1 R132H catalytic activity was monitored using the quantitative liquid chromatography/mass spectrometry (LC-MS) detection of 2-HG, a produc...
Ligand InfoPC cidPC sid
In DepthDetails US Patent
TargetIsocitrate dehydrogenase [NADP] cytoplasmic [R132H](Homo sapiens (Human))
Novartis
US Patent
LigandPNGBDBM175219(US10112931, Example 213 | US9688672, Example 213)
Affinity DataIC50: <22.9nMpH: 7.4 T: 2°C. Assay description: Mutant IDH1 R132H catalytic activity was monitored using the quantitative liquid chromatography/mass spectrometry (LC-MS) detection of 2-HG, a produc...
Ligand InfoPC cidPC sid
In DepthDetails US Patent
TargetIsocitrate dehydrogenase [NADP] cytoplasmic [R132H](Homo sapiens (Human))
Novartis
US Patent
LigandPNGBDBM175219(US10112931, Example 213 | US9688672, Example 213)
Affinity DataIC50:  19nMpH: 7.5 T: 2°C. Assay description: The IDH1 (R132H) mutant catalyzes the reduced form of NADP+ (NADPH) and α-ketoglutarate (α-KG) to form nicotinamide adenine dinucleotide ph...
Ligand InfoPC cidPC sid
In DepthDetails US Patent
TargetIsocitrate dehydrogenase [NADP] cytoplasmic [R132H](Homo sapiens (Human))
Novartis
US Patent
LigandPNGBDBM175219(US10112931, Example 213 | US9688672, Example 213)
Affinity DataIC50:  11nMpH: 7.5 T: 2°C. Assay description: The IDH1 (R132H) mutant catalyzes the reduced form of NADP+ (NADPH) and α-ketoglutarate (α-KG) to form nicotinamide adenine dinucleotide ph...
Ligand InfoPC cidPC sid
In DepthDetails US Patent