BDBM175266 Trans-1-Nitro-4-styrylbenzene (5)
SMILES [O-][N+](=O)c1ccc(\C=C/c2ccccc2)cc1
InChI Key InChIKey=ZISCOWXWCHUSMH-SREVYHEPSA-N
Data  1 IC50
  Tab Delimited (TSV)   2D SDfile   Computed 3D by Vconf -m prep SDfile
Find this compound or compounds like it in BindingDB:
Activity Spreadsheet -- Enzyme Inhibition Constant Data from BindingDB
Found 1 hit for monomerid = 175266
TargetTyrosinase(Mus musculus (Mouse))
Indian Institute Of Integrative Medicine
LigandPNGBDBM175266(Trans-1-Nitro-4-styrylbenzene (5))
Affinity DataIC50:  3.61E+5nMpH: 6.8Assay Description:The reaction mixture contained 50 mM phosphate buffer, pH 6.8, 0.05% L-DOPA and the supernatant (tyrosinase). After incubation in the absence or pres...
In DepthDetails ArticlePubMed