BDBM175339 1-(4-chlorophenyl)-2-(3,4-dihydroquinolin-1(2H)-yl)ethyl 4-chlorophenylcarbamate (6h)
SMILES Clc1ccc(NC(=O)OC(CN2CCCc3ccccc23)c2ccc(Cl)cc2)cc1
InChI Key InChIKey=BQAVRYZGZZQKMS-UHFFFAOYSA-N
Data  1 IC50
  Tab Delimited (TSV)   2D SDfile   Computed 3D by Vconf -m prep SDfile
Find this compound or compounds like it in BindingDB:
Activity Spreadsheet -- Enzyme Inhibition Constant Data from BindingDB
Found 1 hit for monomerid = 175339
TargetReverse transcriptase protein(Human immunodeficiency virus type 1 group M subtyp...)
Birla Institute Of Technology
LigandPNGBDBM175339(1-(4-chlorophenyl)-2-(3,4-dihydroquinolin-1(2H)-yl...)
Affinity DataIC50:  2.38E+4nM. Assay description: The reaction mixture was set with template primer complex, RT enzyme and dNTPs in a lysis buffer with or without inhibitors. The reaction mixture was...
In DepthDetails ArticlePubMed