BDBM175359 Ethyl 2-hydrazinyl-1,4-dimethyl-6-(p-tolyl)-1,6-dihydropyrimidine-5-carboxylate dihydrochloride (20)
SMILES CCOC(=O)C1=C(C)N=C(NN)N(C)C1c1ccc(C)cc1
InChI Key InChIKey=CHNZLYQPUJQBDH-UHFFFAOYSA-N
Data  1 KI  1 IC50
  Tab Delimited (TSV)   2D SDfile   Computed 3D by Vconf -m prep SDfile
Find this compound or compounds like it in BindingDB:
Activity Spreadsheet -- Enzyme Inhibition Constant Data from BindingDB
Found 1 hit for monomerid = 175359
TargetUrease(Canavalia ensiformis (Jack bean) (Horse bean))
University Of Karachi
LigandPNGBDBM175359(Ethyl 2-hydrazinyl-1,4-dimethyl-6-(p-tolyl)-1,6-di...)
Affinity DataKi:  2.94E+4nM IC50:  2.60E+4nM. Assay description: Reaction mixture consisting of 25 µL of Jack bean (Canavalia ensiformis) urease (1 unit/well), 55 µL of 100 mM urea dissolved in phosphate buffer (4 ...
In DepthDetails ArticlePubMed