BDBM175370 1,3-Dimethyl-8-[4-{2-(pyrrolidin-1-yl)-2-oxoethoxy}-phenyl]xanthine (13c, RB-426)
SMILES Cn1c2nc([nH]c2c(=O)n(C)c1=O)-c1ccc(OCC(=O)N2CCCC2)cc1
InChI Key InChIKey=NFIYOVPEXZSLQY-UHFFFAOYSA-N
Data  4 KI
  Tab Delimited (TSV)   2D SDfile   Computed 3D by Vconf -m prep SDfile
Find this compound or compounds like it in BindingDB:
Activity Spreadsheet -- Enzyme Inhibition Constant Data from BindingDB
Found 4 hits for monomerid = 175370
TargetAdenosine receptor A2a(Homo sapiens (Human))
Panjab University
LigandPNGBDBM175370(1,3-Dimethyl-8-[4-{2-(pyrrolidin-1-yl)-2-oxoethoxy...)
Affinity DataKi:  122nM. Assay description: Dissociation constants at A1, A2A and A3 receptors (Ki-values) were determined in radioligand competition experiments as reported earlier [19,20]. Al...
In DepthDetails ArticlePubMed
TargetAdenosine receptor A1(Homo sapiens (Human))
Panjab University
LigandPNGBDBM175370(1,3-Dimethyl-8-[4-{2-(pyrrolidin-1-yl)-2-oxoethoxy...)
Affinity DataKi:  796nM. Assay description: Dissociation constants at A1, A2A and A3 receptors (Ki-values) were determined in radioligand competition experiments as reported earlier [19,20]. Al...
In DepthDetails ArticlePubMed
TargetAdenosine receptor A2b(Homo sapiens (Human))
Panjab University
LigandPNGBDBM175370(1,3-Dimethyl-8-[4-{2-(pyrrolidin-1-yl)-2-oxoethoxy...)
Affinity DataKi:  1.49E+3nM. Assay description: Dissociation constants at A1, A2A and A3 receptors (Ki-values) were determined in radioligand competition experiments as reported earlier [19,20]. Al...
In DepthDetails ArticlePubMed
TargetAdenosine receptor A3 [I248L](Homo sapiens (Human))
Panjab University
LigandPNGBDBM175370(1,3-Dimethyl-8-[4-{2-(pyrrolidin-1-yl)-2-oxoethoxy...)
Affinity DataKi:  5.68E+3nM. Assay description: Dissociation constants at A1, A2A and A3 receptors (Ki-values) were determined in radioligand competition experiments as reported earlier [19,20]. Al...
In DepthDetails ArticlePubMed