BDBM175404 2-Dicyanomethylene-6-methyl-4,6-bis(phenyl)-1,2,5,6-tetrahydronicotinonitrile (5a)
SMILES [#6]C1([#6]-[#6](=[#6](C#N)\[#6](-[#7]1)=[#6](/C#N)C#N)-c1ccccc1)c1ccccc1
InChI Key InChIKey=VNMKBDSXUAAAFZ-UHFFFAOYSA-N
Data  2 IC50
  Tab Delimited (TSV)   2D SDfile   Computed 3D by Vconf -m prep SDfile
Find this compound or compounds like it in BindingDB:
Activity Spreadsheet -- Enzyme Inhibition Constant Data from BindingDB
Found 2 hits for monomerid = 175404
TargetCarboxylic ester hydrolase(Equus caballus (Horse))
University Of Karachi
LigandPNGBDBM175404(2-Dicyanomethylene-6-methyl-4,6-bis(phenyl)-1,2,5,...)
Affinity DataIC50:  4.81E+4nMpH: 8.0Assay Description:Inhibitory activities of AChE and BChE were evaluated by using the Ellman's method [34]. Herein compounds 2(a-h) and 5(a-h) were evaluated as inh...
In DepthDetails ArticlePubMed
TargetAcetylcholinesterase(Electrophorus electricus (Electric eel))
University Of Karachi
LigandPNGBDBM175404(2-Dicyanomethylene-6-methyl-4,6-bis(phenyl)-1,2,5,...)
Affinity DataIC50:  2.03E+4nMpH: 8.0Assay Description:Inhibitory activities of AChE and BChE were evaluated by using the Ellman's method [34]. Herein compounds 2(a-h) and 5(a-h) were evaluated as inh...
In DepthDetails ArticlePubMed