BDBM175416 2-(Cyano(1H-tetrazol-5-yl)methylene)-6-methyl-4,6-bis(3'/3''-chlorophenyl)-1,2,5,6-tetrahydronicotinonitrile (2e)
SMILES CC1(CC(=C(C#N)C(N1)=C(C#N)c1nnn[nH]1)c1cccc(Cl)c1)c1cccc(Cl)c1
InChI Key
Data  2 IC50
  Tab Delimited (TSV)   2D SDfile   Computed 3D by Vconf -m prep SDfile
Find this compound or compounds like it in BindingDB:
Activity Spreadsheet -- Enzyme Inhibition Constant Data from BindingDB
Found 2 hits for monomerid = 175416
TargetCarboxylic ester hydrolase(Equus caballus (Horse))
University Of Karachi
LigandPNGBDBM175416(2-(Cyano(1H-tetrazol-5-yl)methylene)-6-methyl-4,6-...)
Affinity DataIC50:  2.78E+3nMpH: 8.0Assay Description:Inhibitory activities of AChE and BChE were evaluated by using the Ellman's method [34]. Herein compounds 2(a-h) and 5(a-h) were evaluated as inh...
In DepthDetails ArticlePubMed
TargetAcetylcholinesterase(Electrophorus electricus (Electric eel))
University Of Karachi
LigandPNGBDBM175416(2-(Cyano(1H-tetrazol-5-yl)methylene)-6-methyl-4,6-...)
Affinity DataIC50:  2.32E+3nMpH: 8.0Assay Description:Inhibitory activities of AChE and BChE were evaluated by using the Ellman's method [34]. Herein compounds 2(a-h) and 5(a-h) were evaluated as inh...
In DepthDetails ArticlePubMed