BDBM175523 US9119845, 24
SMILES CC(C)CCCN1CC[C@@H](O)[C@H](O)[C@H]1CO
InChI Key InChIKey=PEXRHGIILBQHBC-IJLUTSLNSA-N
Data  1 KI  1 IC50  1 EC50
  Tab Delimited (TSV)   2D SDfile   Computed 3D by Vconf -m prep SDfile
Find this compound or compounds like it in BindingDB:
Activity Spreadsheet -- Enzyme Inhibition Constant Data from BindingDB
Found 1 hit for monomerid = 175523
TargetLysosomal acid glucosylceramidase(Mus musculus (Mouse))
Amicus Therapeutics
US Patent
LigandPNGBDBM175523(US9119845, 24)
Affinity DataKi:  880nM IC50:  2.13E+3nM EC50:  3.05E+4nMpH: 4.5Assay Description:To 2.5 μl of supernatant (in 96-well plates) was added 17.5 μl reaction buffer (citrate phosphate buffer, pH 4.5, no Triton X-100), and 50 ...
In DepthDetails US Patent