BDBM175793 US9688683, 51
SMILES CCc1nc(nc2N(CCc12)c1cccc(OC(=O)NCC2CC2)c1)-c1ccc(OC)c(F)c1
InChI Key InChIKey=LLDDKNBBWYQJCY-UHFFFAOYSA-N
Data  1 IC50
  Tab Delimited (TSV)   2D SDfile   Computed 3D by Vconf -m prep SDfile
Find this compound or compounds like it in BindingDB:
Activity Spreadsheet -- Enzyme Inhibition Constant Data from BindingDB
Found 1 hit for monomerid = 175793
TargetcAMP-specific 3',5'-cyclic phosphodiesterase 4B(Homo sapiens (Human))
GrÜNenthal
US Patent
LigandPNGBDBM175793(US9688683, 51)
Affinity DataIC50:  5.50E+3nMpH: 7.8 T: 2°C. Assay description: The test compound or water (control) is mixed with the human recombinant PDE4B1 enzyme (4.8 U) in a buffer consisting of 44.4 mM tris-HCl, 5.28 mM Mg...
Ligand InfoPC cidPC sid
In DepthDetails US Patent