BDBM175892 US9688684, Compound 89: 7-Benzyl-8-(3-fluoro-phenyl)-5,6,7,8-tetrahydro-tetrazolo[1,5-a]pyrazine
SMILES Fc1cccc(c1)C1N(Cc2ccccc2)CCn2nnnc12
InChI Key InChIKey=GRWNITPUKJMBAZ-UHFFFAOYSA-N
Data  2 IC50
  Tab Delimited (TSV)   2D SDfile   Computed 3D by Vconf -m prep SDfile
Find this compound or compounds like it in BindingDB:
Activity Spreadsheet -- Enzyme Inhibition Constant Data from BindingDB
Found 2 hits for monomerid = 175892
TargetNuclear receptor ROR-gamma [238-497](Homo sapiens (Human))
Merck Patent
US Patent
LigandPNGBDBM175892(US9688684, Compound 89: 7-Benzyl-8-(3-fluoro-pheny...)
Affinity DataIC50:  5.45E+3nM. Assay description: For the assay 12,500 293T cells (DSMZ no ACC 635) per 384 well are seeded in 30 μl inMEM Eagle medium, supplemented with 10% FBS, 2 mM Glutamax,...
Ligand InfoPC cidPC sid
In DepthDetails US Patent
TargetNuclear receptor ROR-gamma [238-497](Homo sapiens (Human))
Merck Patent
US Patent
LigandPNGBDBM175892(US9688684, Compound 89: 7-Benzyl-8-(3-fluoro-pheny...)
Affinity DataIC50:  500nMpH: 6.8Assay Description:In this assay, a GST-tagged human RORγ ligand binding domain (GST-hRORγ-LBD) interacts with a synthetic biotinylated TRAP220 cofactor pepti...
Ligand InfoPC cidPC sid
In DepthDetails US Patent