BDBM17624 2-ethoxy-3-ethyl-6-[(4-fluorobenzene)sulfonamido]benzoic acid::5,6-disubstituted anthranilic acid sulfonamide, 16a
SMILES CCOc1c(CC)ccc(NS(=O)(=O)c2ccc(F)cc2)c1C(O)=O
InChI Key InChIKey=JGGAEBBDBSPMTR-UHFFFAOYSA-N
Data  1 IC50
  Tab Delimited (TSV)   2D SDfile   Computed 3D by Vconf -m prep SDfile
Find this compound or compounds like it in BindingDB:
Activity Spreadsheet -- Enzyme Inhibition Constant Data from BindingDB
Found 1 hit for monomerid = 17624
TargetMethionine aminopeptidase 2(Homo sapiens (Human))
Abbott Laboratories
LigandPNGBDBM17624(2-ethoxy-3-ethyl-6-[(4-fluorobenzene)sulfonamido]b...)
Affinity DataIC50:  38nMpH: 7.4 T: 2°C. Assay description: A coupled enzyme chromogenic assay was developed to measure methionine aminopeptidase-2 activity by monitoring the production of free methionine with...
In DepthDetails ArticlePubMed