BDBM176296 US9688696, 11
SMILES Clc1cccc(Cl)c1Cc1nccc(n1)-c1ccc(cc1)N1CCN(CC1)C(=O)Nc1c(Cl)cccc1Cl
InChI Key InChIKey=ORDOCNJWDIAIMR-UHFFFAOYSA-N
Data  1 IC50
  Tab Delimited (TSV)   2D SDfile   Computed 3D by Vconf -m prep SDfile
Find this compound or compounds like it in BindingDB:
Activity Spreadsheet -- Enzyme Inhibition Constant Data from BindingDB
Found 1 hit for monomerid = 176296
TargetDiacylglycerol O-acyltransferase 1(Homo sapiens (Human))
Janssen Pharmaceutica
US Patent
LigandPNGBDBM176296(US9688696, 11)
Affinity DataIC50:  1.95E+3nMpH: 7.4 T: 2°C. Assay description: DGAT activity in membrane preparations was assayed in 50 mM Tris-HCl (pH 7.4), 150 mM MgCl2, 1 mM EDTA and 0.2% BSA, containing 50 μM DAG, 32 &#...
Ligand InfoPC cidPC sid
In DepthDetails US Patent