BDBM176363 US9688696, 79
SMILES CN(C)c1ccc(NC(=O)N2CCN(CC2)c2ccc(cc2)-c2nc3cnn(Cc4ccc(C)cc4)c3[nH]2)cc1
InChI Key InChIKey=GBAJMCUNXQISJC-UHFFFAOYSA-N
Data  1 IC50
  Tab Delimited (TSV)   2D SDfile   Computed 3D by Vconf -m prep SDfile
Find this compound or compounds like it in BindingDB:
Activity Spreadsheet -- Enzyme Inhibition Constant Data from BindingDB
Found 1 hit for monomerid = 176363
TargetDiacylglycerol O-acyltransferase 1(Homo sapiens (Human))
Janssen Pharmaceutica
US Patent
LigandPNGBDBM176363(US9688696, 79)
Affinity DataIC50:  1.82E+3nMpH: 7.4 T: 2°C. Assay description: DGAT activity in membrane preparations was assayed in 50 mM Tris-HCl (pH 7.4), 150 mM MgCl2, 1 mM EDTA and 0.2% BSA, containing 50 μM DAG, 32 &#...
Ligand InfoPC cidPC sid
In DepthDetails US Patent