BDBM176481 US9120752, 22
SMILES Fc1ccc(Oc2ccc(cc2)-c2cccc(n2)C(=O)NCCNS(=O)(=O)c2cccnc2)cc1
InChI Key InChIKey=ASSBJBDALLTKNV-UHFFFAOYSA-N
Data  1 IC50
  Tab Delimited (TSV)   2D SDfile   Computed 3D by Vconf -m prep SDfile
Find this compound or compounds like it in BindingDB:
Activity Spreadsheet -- Enzyme Inhibition Constant Data from BindingDB
Found 1 hit for monomerid = 176481
TargetSodium channel protein type 9 subunit alpha(Homo sapiens (Human))
Purdue Pharma
US Patent
LigandPNGBDBM176481(US9120752, 22)
Affinity DataIC50:  310nMT: 2°C. Assay description: Cells were prepared by plating the recombinant HEK293 cells or other host cells expressing either recombinant or non-recombinant, native, Nav1.7 alph...
In DepthDetails US Patent