BDBM17649 6-chloro-N-[(3S)-1-[(2S)-1-(morpholin-4-yl)-1-oxopropan-2-yl]-2-oxopyrrolidin-3-yl]thieno[3,2-b]pyridine-2-sulfonamide::N-[(3S)-2-oxopyrrolidin-3-yl]sulfonamide, 1l
SMILES C[C@H](N1CC[C@H](NS(=O)(=O)c2cc3ncc(Cl)cc3s2)C1=O)C(=O)N1CCOCC1
InChI Key InChIKey=STFCHVHDCAKEKC-AAEUAGOBSA-N
Data  1 KI
  Tab Delimited (TSV)   2D SDfile   Computed 3D by Vconf -m prep SDfile
Find this compound or compounds like it in BindingDB:
Activity Spreadsheet -- Enzyme Inhibition Constant Data from BindingDB
Found 1 hit for monomerid = 17649
TargetCoagulation factor X(Homo sapiens (Human))
Gsk
LigandPNGBDBM17649(6-chloro-N-[(3S)-1-[(2S)-1-(morpholin-4-yl)-1-oxop...)
Affinity DataKi:  3.67E+3nM ΔG°:  -7.34kcal/molepH: 7.4 T: 2°C. Assay description: The ability of test compounds to inhibit human fXa in vitro was determined in a fluorescence assay using rhodamime 110, bis-(Boc-L-glycylglycyl-L-arg...
In DepthDetails ArticlePubMed