BDBM176750 CAS# 4754-63-6::Dimethyl Acetophenone Bisphenol::US9688816, E
SMILES Cc1cc(ccc1O)C(C)(c1ccccc1)c1ccc(O)c(C)c1
InChI Key InChIKey=MMNLWVVVDFQANH-UHFFFAOYSA-N
Data  2 IC50
  Tab Delimited (TSV)   2D SDfile   Computed 3D by Vconf -m prep SDfile
Find this compound or compounds like it in BindingDB:
Activity Spreadsheet -- Enzyme Inhibition Constant Data from BindingDB
Found 2 hits for monomerid = 176750
TargetEstrogen receptor beta(Homo sapiens (Human))
Sabic Global Technologies
US Patent
LigandPNGBDBM176750(CAS# 4754-63-6 | Dimethyl Acetophenone Bisphenol |...)
Affinity DataIC50:  3.50E+3nM. Assay description: Competitive binding assays were performed by incubating rhER alpha (α) and beta 1 (β1) receptors with 10 nM [3H]estradiol (the radio ligand...
Ligand InfoPC cidPC sid
In DepthDetails US Patent
TargetEstrogen receptor(Homo sapiens (Human))
Sabic Global Technologies
US Patent
LigandPNGBDBM176750(CAS# 4754-63-6 | Dimethyl Acetophenone Bisphenol |...)
Affinity DataIC50:  4.80E+3nM. Assay description: Competitive binding assays were performed by incubating rhER alpha (α) and beta 1 (β1) receptors with 10 nM [3H]estradiol (the radio ligand...
Ligand InfoPC cidPC sid
In DepthDetails US Patent